Target
Mitogen-activated protein kinase 14
Ligand
BDBM247062
Substrate
Meas. Tech.
p38 MAPKalpaha Enzyme Inhibition 1
IC50
1.000±n/a nM
Citation
 Cariou, CACharron, CEFordyce, EAHamza, DFyfe, MCIto, KKing-Underwood, JMurray, PJOnions, STThom, SMWatson, HTWilliams, JG Pyrazolyl-ureas as kinase inhibitors US Patent  US9701670 Publication Date 7/11/2017 
Target
Name:
Mitogen-activated protein kinase 14
Synonyms:
CSAID-binding protein CSBP1 CSPB1 MAP kinase 14 MAP kinase p38 alpha MAPK14 MK14_HUMAN Mitogen-activated protein kinase p38 alpha Stress-activated protein kinase 2a | p38 MAP kinase alpha/beta
Type:
Serine/threonine-protein kinase
Mol. Mass.:
41286.76
Organism:
Homo sapiens (Human)
Description:
Q16539
Residue:
360
  
Inhibitor
Name:
BDBM247062
Synonyms:
N-(2-(Dimethylamino)ethyl)-3-((4-((4-(3-(3-isopropyl-1-(4-methoxyphenyl)-1H-pyrazol-5-yl)ureido)naphthalen-1-yl)oxy)pyrimidin-2-yl)amino)-5-methoxy benzamide | US9701670, 6
Type:
Small organic molecule
Emp. Form.:
C40H43N9O5
Mol. Mass.:
729.8267
SMILES:
COc1ccc(cc1)-n1nc(cc1NC(=O)Nc1ccc(Oc2ccnc(Nc3cc(OC)cc(c3)C(=O)NCCN(C)C)n2)c2ccccc12)C(C)C
: