Target
Proto-oncogene tyrosine-protein kinase Src
Ligand
BDBM247104
Substrate
Meas. Tech.
c-Src Enzyme Inhibition 1
IC50
1.000±n/a nM
Citation
 Cariou, CACharron, CEFordyce, EAHamza, DFyfe, MCIto, KKing-Underwood, JMurray, PJOnions, STThom, SMWatson, HTWilliams, JG Pyrazolyl-ureas as kinase inhibitors US Patent  US9701670 Publication Date 7/11/2017 
Target
Name:
Proto-oncogene tyrosine-protein kinase Src
Synonyms:
Calmodulin/Proto-oncogene tyrosine-protein kinase Src Proto-oncogene c-Src SRC SRC_HUMAN V-src sarcoma (Schmidt-Ruppin A-2) viral oncogene homolog (avian) p60-Src | pp60c-src
Type:
Protein
Mol. Mass.:
59838.60
Organism:
Homo sapiens (Human)
Description:
P12931
Residue:
536
  
Inhibitor
Name:
BDBM247104
Synonyms:
3-((4-((4-(3-(3-ethyl-1-(p-tolyl)-1H-pyrazol-5-yl)ureido)naphthalen-1-yl)oxy)pyrimidin-2-yl)amino)-5-methoxy-N-(2-morpholinoethyl)benzamide | US9701670, 49
Type:
Small organic molecule
Emp. Form.:
C41H43N9O5
Mol. Mass.:
741.8374
SMILES:
CCc1cc(NC(=O)Nc2ccc(Oc3ccnc(Nc4cc(OC)cc(c4)C(=O)NCCN4CCOCC4)n3)c3ccccc23)n(n1)-c1ccc(C)cc1
: