Target
Proto-oncogene tyrosine-protein kinase Src
Ligand
BDBM247114
Substrate
Meas. Tech.
c-Src Enzyme Inhibition 1
IC50
<1.000±n/a nM
Citation
 Cariou, CACharron, CEFordyce, EAHamza, DFyfe, MCIto, KKing-Underwood, JMurray, PJOnions, STThom, SMWatson, HTWilliams, JG Pyrazolyl-ureas as kinase inhibitors US Patent  US9701670 Publication Date 7/11/2017 
Target
Name:
Proto-oncogene tyrosine-protein kinase Src
Synonyms:
Calmodulin/Proto-oncogene tyrosine-protein kinase Src Proto-oncogene c-Src SRC SRC_HUMAN V-src sarcoma (Schmidt-Ruppin A-2) viral oncogene homolog (avian) p60-Src | pp60c-src
Type:
Protein
Mol. Mass.:
59838.60
Organism:
Homo sapiens (Human)
Description:
P12931
Residue:
536
  
Inhibitor
Name:
BDBM247114
Synonyms:
3-methoxy-5-((4-((4-(3-(1-(4-methoxyphenyl)-3-(tetrahydrofuran-3-yl)-1H-pyrazol-5-yl)ureido)naphthalen-1-yl)oxy)pyrimidin-2-yl)amino)-N-(2-morpholinoethyl)benzamide | US9701670, 59
Type:
Small organic molecule
Emp. Form.:
C43H45N9O7
Mol. Mass.:
799.8735
SMILES:
COc1ccc(cc1)-n1nc(cc1NC(=O)Nc1ccc(Oc2ccnc(Nc3cc(OC)cc(c3)C(=O)NCCN3CCOCC3)n2)c2ccccc12)C1CCOC1
: