Target
Adenosine receptor A2a
Ligand
BDBM21224
Substrate
BDBM21241
Meas. Tech.
Human A1 Adenosine Receptor Binding Assay
Ki
1121±n/a nM
Citation
 Cosimelli, BGreco, GEhlardo, MNovellino, EDa Settimo, FTaliani, SLa Motta, CBellandi, MTuccinardi, TMartinelli, ACiampi, OTrincavelli, MLMartini, C Derivatives of 4-Amino-6-hydroxy-2-mercaptopyrimidine as Novel, Potent, and Selective A3 Adenosine Receptor Antagonists. J Med Chem 51:1764-70 (2008)  
Target
Name:
Adenosine receptor A2a
Synonyms:
A2A adenosine receptor (hA2A) ADENOSINE A2 ADORA2 Adenosine A2A receptor (A2AAR)
Type:
G Protein-Coupled Receptor (GPCR)
Mol. Mass.:
44716.46
Organism:
Homo sapiens (Human)
Description:
P29274
Residue:
412
  
Inhibitor
Name:
BDBM21224
Synonyms:
2-mercaptopyrimidine analogue, 5c | N-[2-(methylsulfanyl)-6-propoxypyrimidin-4-yl]acetamide
Type:
Small organic molecule
Emp. Form.:
C10H15N3O2S
Mol. Mass.:
241.31
SMILES:
CCCOc1cc(NC(C)=O)nc(SC)n1
:
Substrate
Name:
BDBM21241
Synonyms:
Adenosine, N6-Ethyl-carboxamido N-Ethylcarboxamidoadenosine | [3H]NECA
Type:
Emp. Form.:
Mol. Mass.:
SMILES:
: