Target
Cytochrome P450 1A2
Ligand
BDBM21358
Substrate
BDBM21360
Meas. Tech.
Cytochrome P450 Inhibition
pH
7.4±n/a
Temperature
310.15±n/a K
IC50
149000±n/a nM
Citation
 Cole, DCStock, JRLennox, WJBernotas, RCEllingboe, JWBoikess, SCoupet, JSmith, DLLeung, LZhang, GMFeng, XKelly, MFGalante, RHuang, PDawson, LAMarquis, KRosenzweig-Lipson, SBeyer, CESchechter, LE Discovery of N1-(6-chloroimidazo[2,1-b][1,3]thiazole-5-sulfonyl)tryptamine as a potent, selective, and orally active 5-HT(6) receptor agonist. J Med Chem 50:5535-8 (2007)  
Target
Name:
Cytochrome P450 1A2
Synonyms:
CP1A2_HUMAN CYPIA2 Cytochrome P(3)450 Cytochrome P450 1A2 (CYP1A2) Cytochrome P450-P3
Type:
Enzyme
Mol. Mass.:
58423.38
Organism:
Homo sapiens (Human)
Description:
P05177
Residue:
516
  
Inhibitor
Name:
BDBM21358
Synonyms:
2-[1-({6-chloroimidazo[2,1-b][1,3]thiazole-5-}sulfonyl)-1H-indol-3-yl]ethan-1-amine SAX-187 | WAY-181187
Type:
Small organic molecule
Emp. Form.:
C15H13ClN4O2S2
Mol. Mass.:
380.872
SMILES:
NCCc1cn(c2ccccc12)S(=O)(=O)c1c(Cl)nc2sccn12
:
Substrate
Name:
BDBM21360
Synonyms:
7-ethoxy-3H-phenoxazin-3-one Ethoxyresorufin | US9216974, Ethoxy-resorufin
Type:
Small organic molecule
Emp. Form.:
C14H11NO3
Mol. Mass.:
241.242
SMILES:
CCOc1ccc2nc3ccc(=O)cc3oc2c1
: