Target
Apoptosis regulator Bcl-2
Ligand
BDBM21420
Substrate
Fluorescein-labeled BAX peptide
Meas. Tech.
Fluorescence Polarization Assay and FL5.12 Cellular Assay
Ki
1.5±n/a nM
EC50
200±n/a nM
Citation
 Bruncko, MOost, TKBelli, BADing, HJoseph, MKKunzer, AMartineau, DMcClellan, WJMitten, MNg, SCNimmer, PMOltersdorf, TPark, CMPetros, AMShoemaker, ARSong, XWang, XWendt, MDZhang, HFesik, SWRosenberg, SHElmore, SW Studies leading to potent, dual inhibitors of Bcl-2 and Bcl-xL. J Med Chem 50:641-62 (2007)  
Target
Name:
Apoptosis regulator Bcl-2
Synonyms:
Apoptosis regulator Bcl-2 Protein BCL-2 BCL2_HUMAN | Bcl-2 Protein
Type:
Homodimer or heterodimer
Mol. Mass.:
26269.11
Organism:
Homo sapiens (Human)
Description:
P10415
Residue:
239
  
Inhibitor
Name:
BDBM21420
Synonyms:
4-Alkyl-4-methoxypiperidine derivative, 8l | 4-{4-[(2-bromophenyl)methyl]-4-methoxypiperidin-1-yl}-N-[(4-{[(2R)-4-(dimethylamino)-1-(phenylsulfanyl)butan-2-yl]amino}-3-nitrobenzene)sulfonyl]benzamide
Type:
Small organic molecule
Emp. Form.:
C38H44BrN5O6S2
Mol. Mass.:
810.82
SMILES:
COC1(Cc2ccccc2Br)CCN(CC1)c1ccc(cc1)C(=O)NS(=O)(=O)c1ccc(N[C@H](CCN(C)C)CSc2ccccc2)c(c1)[N+]([O-])=O
:
Substrate
Name:
Fluorescein-labeled BAX peptide
Synonyms:
Type:
fluorescein-labeled probe
Mol. Mass.:
2800.15
Organism:
Description:
Residue:
25