Target
Apoptosis regulator Bcl-2
Ligand
BDBM21428
Substrate
Fluorescein-labeled BAX peptide
Meas. Tech.
Fluorescence Polarization Assay and FL5.12 Cellular Assay
Ki
2.0±n/a nM
EC50
250±n/a nM
Citation
 Bruncko, MOost, TKBelli, BADing, HJoseph, MKKunzer, AMartineau, DMcClellan, WJMitten, MNg, SCNimmer, PMOltersdorf, TPark, CMPetros, AMShoemaker, ARSong, XWang, XWendt, MDZhang, HFesik, SWRosenberg, SHElmore, SW Studies leading to potent, dual inhibitors of Bcl-2 and Bcl-xL. J Med Chem 50:641-62 (2007)  
Target
Name:
Apoptosis regulator Bcl-2
Synonyms:
Apoptosis regulator Bcl-2 Protein BCL-2 BCL2_HUMAN | Bcl-2 Protein
Type:
Homodimer or heterodimer
Mol. Mass.:
26269.11
Organism:
Homo sapiens (Human)
Description:
P10415
Residue:
239
  
Inhibitor
Name:
BDBM21428
Synonyms:
4-Piperidinebenzylidene derivative, 10g | N-[(4-{[(2R)-4-(dimethylamino)-1-(phenylsulfanyl)butan-2-yl]amino}-3-nitrobenzene)sulfonyl]-4-{4-[(2-methoxyphenyl)methylidene]piperidin-1-yl}benzamide
Type:
Small organic molecule
Emp. Form.:
C38H43N5O6S2
Mol. Mass.:
729.908
SMILES:
[#6]-[#8]-c1ccccc1\[#6]=[#6]-1/[#6]-[#6]-[#7](-[#6]-[#6]-1)-c1ccc(cc1)-[#6](=O)-[#7]S(=O)(=O)c1ccc(-[#7]-[#6@H](-[#6]-[#6]-[#7](-[#6])-[#6])-[#6]-[#16]-c2ccccc2)c(c1)-[#7+](-[#8-])=O
:
Substrate
Name:
Fluorescein-labeled BAX peptide
Synonyms:
Type:
fluorescein-labeled probe
Mol. Mass.:
2800.15
Organism:
Description:
Residue:
25