Target
Prostaglandin D2 receptor 2
Ligand
BDBM21597
Substrate
BDBM21544
Meas. Tech.
Radioligand Binding Assay and [35S] GTP-gamma-S Binding Assay
Ki
702±n/a nM
Citation
 Crosignani, SPage, PMissotten, MColovray, VCleva, CArrighi, JFAtherall, JMacritchie, JMartin, THumbert, YGaudet, MPupowicz, DMaio, MPittet, PAGolzio, LGiachetti, CRocha, CBernardinelli, GFilinchuk, YScheer, ASchwarz, MKChollet, A Discovery of a New Class of Potent, Selective, and Orally Bioavailable CRTH2 (DP2) Receptor Antagonists for the Treatment of Allergic Inflammatory Diseases. J Med Chem 51:2227-2243 (2008)  
Target
Name:
Prostaglandin D2 receptor 2
Synonyms:
CD_antigen=CD294 Chemoattractant Receptor-homologous molecule expressed on T-helper type 2 cells (CRTH2) Chemoattractant receptor-homologous molecule expressed on Th2 cells (CRTH2) G protein-coupled receptor 44 GPR44 PTGDR2 Prostaglandin D2 receptor 2 | Prostaglandin D2 receptor 2 (PGD2)
Type:
Enzyme
Mol. Mass.:
43295.45
Organism:
Homo sapiens (Human)
Description:
Q9Y5Y4
Residue:
395
  
Inhibitor
Name:
BDBM21597
Synonyms:
2-{1'-benzyl-5-chloro-1,2-dihydrospiro[indole-3,3'-pyrrolidine]-2,5'-dione}acetic acid | Spiro-indolinone analogue, 89
Type:
Small organic molecule
Emp. Form.:
C20H17ClN2O4
Mol. Mass.:
384.813
SMILES:
OC(=O)CN1C(=O)C2(CN(Cc3ccccc3)C(=O)C2)c2cc(Cl)ccc12
:
Substrate
Name:
BDBM21544
Synonyms:
(5Z)-7-[(1R,2R,5S)-5-hydroxy-2-[(1E,3S)-3-hydroxyoct-1-en-1-yl]-3-oxocyclopentyl]hept-5-enoic acid Prostaglandin D2 | [3H]PGD2
Type:
radiolabeled ligand
Emp. Form.:
C20H32O5
Mol. Mass.:
352.4651
SMILES:
CCCCC[C@H](O)\C=C\[C@@H]1[C@@H](C\C=C/CCCC(O)=O)[C@@H](O)CC1=O
: