Target
DNA polymerase subunit gamma-1
Ligand
BDBM21686
Substrate
BDBM21687
Meas. Tech.
DNA Polymerase Activity Assay
pH
7.5±n/a
Temperature
310.15±n/a K
Ki
>1008000±n/a nM
Citation
 Butler, MMLamarr, WAFoster, KABarnes, MHSkow, DJLyden, PTKustigian, LMZhi, CBrown, NCWright, GEBowlin, TL Antibacterial activity and mechanism of action of a novel anilinouracil-fluoroquinolone hybrid compound. Antimicrob Agents Chemother 51:119-27 (2007)  
Target
Name:
DNA polymerase subunit gamma-1
Synonyms:
DNA Polymerase gamma DNA polymerase (alpha/delta/epsilon) DNA polymerase delta subunit 1 DNA polymerase gamma subunit 1 DNA polymerase kappa DNA polymerase subunit gamma-1 DPOG1_HUMAN Mitochondrial DNA polymerase catalytic subunit POLG1 PolG-alpha
Type:
Enzyme Subunit
Mol. Mass.:
139566.98
Organism:
Homo sapiens (Human)
Description:
Enzyme was purchased from Ulrich Hubscher, University of Zurich-Irchel, Switzerland.
Residue:
1239
  
Inhibitor
Name:
BDBM21686
Synonyms:
3-(4-hydroxybutyl)-6-(3-ethyl-4-methylanilino)uracil CHEMBL327687 HBEMAU
Type:
Small organic molecule
Emp. Form.:
C17H23N3O3
Mol. Mass.:
317.3828
SMILES:
CCc1cc(Nc2cc(=O)n(CCCCO)c(=O)[nH]2)ccc1C
:
Substrate
Name:
BDBM21687
Synonyms:
({[({[(2R,3S,5R)-5-(2-amino-6-oxo-6,9-dihydro-3H-purin-9-yl)-3-hydroxyoxolan-2-yl]methoxy}(hydroxy)phosphoryl)oxy](hydroxy)phosphoryl}oxy)phosphonic acid deoxyguanosine triphosphate
Type:
Nucleoside or nucleotide
Emp. Form.:
C10H16N5O13P3
Mol. Mass.:
507.181
SMILES:
Nc1nc2n(cnc2c(=O)[nH]1)[C@H]1C[C@H](O)[C@@H](COP(O)(=O)OP(O)(=O)OP(O)(O)=O)O1
: