Target
DNA polymerase subunit gamma-1
Ligand
BDBM21688
Substrate
BDBM21687
Meas. Tech.
DNA Polymerase Activity Assay
pH
7.5±n/a
Temperature
310.15±n/a K
Ki
684000±n/a nM
Citation
 Butler, MMLamarr, WAFoster, KABarnes, MHSkow, DJLyden, PTKustigian, LMZhi, CBrown, NCWright, GEBowlin, TL Antibacterial activity and mechanism of action of a novel anilinouracil-fluoroquinolone hybrid compound. Antimicrob Agents Chemother 51:119-27 (2007)  
Target
Name:
DNA polymerase subunit gamma-1
Synonyms:
DNA Polymerase gamma DNA polymerase (alpha/delta/epsilon) DNA polymerase delta subunit 1 DNA polymerase gamma subunit 1 DNA polymerase kappa DNA polymerase subunit gamma-1 DPOG1_HUMAN Mitochondrial DNA polymerase catalytic subunit POLG1 PolG-alpha
Type:
Enzyme Subunit
Mol. Mass.:
139566.98
Organism:
Homo sapiens (Human)
Description:
Enzyme was purchased from Ulrich Hubscher, University of Zurich-Irchel, Switzerland.
Residue:
1239
  
Inhibitor
Name:
BDBM21688
Synonyms:
1-cyclopropyl-7-[4-(4-{4-[(3-ethyl-4-methylphenyl)amino]-2,6-dioxo-1,2,3,6-tetrahydropyrimidin-1-yl}butyl)-3-methylpiperazin-1-yl]-6,8-difluoro-4-oxo-1,4-dihydroquinoline-3-carboxylic acid 251D | CHEMBL201900
Type:
Small organic molecule
Emp. Form.:
C35H40F2N6O5
Mol. Mass.:
662.7261
SMILES:
CCc1cc(Nc2cc(=O)n(CCCCN3CCN(CC3C)c3c(F)cc4c(c3F)n(cc(C(O)=O)c4=O)C3CC3)c(=O)[nH]2)ccc1C
:
Substrate
Name:
BDBM21687
Synonyms:
({[({[(2R,3S,5R)-5-(2-amino-6-oxo-6,9-dihydro-3H-purin-9-yl)-3-hydroxyoxolan-2-yl]methoxy}(hydroxy)phosphoryl)oxy](hydroxy)phosphoryl}oxy)phosphonic acid deoxyguanosine triphosphate
Type:
Nucleoside or nucleotide
Emp. Form.:
C10H16N5O13P3
Mol. Mass.:
507.181
SMILES:
Nc1nc2n(cnc2c(=O)[nH]1)[C@H]1C[C@H](O)[C@@H](COP(O)(=O)OP(O)(=O)OP(O)(O)=O)O1
: