Target
Poly(ADP-ribose) glycohydrolase
Ligand
BDBM371051
Substrate
Meas. Tech.
PARG Assay
IC50
92.0±n/a nM
Citation
 McGonagle, AEJordan, AWaszkowycz, BHutton, CWaddell, IHitchin, JRSmith, KMHamilton, NM 2,4-dioxo-quinazoline-6-sulfonamide derivatives as inhibitors of PARG US Patent  US10239843 Publication Date 3/26/2019 
Target
Name:
Poly(ADP-ribose) glycohydrolase
Synonyms:
PARG Poly(ADP-ribose) glycohydrolase | poly(ADP-ribose) glycohydrolase (PARG)
Type:
Protein
Mol. Mass.:
111107.13
Organism:
Homo sapiens (Human)
Description:
Q86W56
Residue:
976
  
Inhibitor
Name:
BDBM371051
Synonyms:
US10239843, Example 158
Type:
Small organic molecule
Emp. Form.:
C22H26N4O5S
Mol. Mass.:
458.531
SMILES:
Cc1noc(C)c1Cn1c(=O)n(CC2CC2)c2ccc(cc2c1=O)S(=O)(=O)NC1(C)CC1
: