Target
Poly [ADP-ribose] polymerase 1
Ligand
BDBM371051
Substrate
Meas. Tech.
PARP1 Assay
IC50
>150000±n/a nM
Citation
 McGonagle, AEJordan, AWaszkowycz, BHutton, CWaddell, IHitchin, JRSmith, KMHamilton, NM 2,4-dioxo-quinazoline-6-sulfonamide derivatives as inhibitors of PARG US Patent  US10239843 Publication Date 3/26/2019 
Target
Name:
Poly [ADP-ribose] polymerase 1
Synonyms:
(ARTD1 or PARP1) 2.4.2.30 ADPRT ARTD1 Human diphtheria toxin-like ADP-ribosyltransferase (ARTD1 or PARP1) NT-PARP-1 PARP1 PPOL Poly [ADP-ribose] polymerase 1 (PARP) Poly [ADP-ribose] polymerase 1 (PARP1) Poly [ADP-ribose] polymerase 1, 28-kDa form Poly [ADP-ribose] polymerase 1, processed C-terminus Poly [ADP-ribose] polymerase-1 Poly(ADP-ribose) polymerase-1 (ARTD1/PARP1) Protein poly-ADP-ribosyltransferase PARP1 | Synonyms=ADPRT
Type:
Mol. Mass.:
113114.22
Organism:
Homo sapiens (Human)
Description:
P09874
Residue:
1014
  
Inhibitor
Name:
BDBM371051
Synonyms:
US10239843, Example 158
Type:
Small organic molecule
Emp. Form.:
C22H26N4O5S
Mol. Mass.:
458.531
SMILES:
Cc1noc(C)c1Cn1c(=O)n(CC2CC2)c2ccc(cc2c1=O)S(=O)(=O)NC1(C)CC1
: