Target
Histone acetyltransferase KAT2B
Ligand
BDBM50234944
Substrate
Meas. Tech.
PCAF AlphaLisa Binding Assay
IC50
235±n/a nM
Citation
 Albrecht, BKBurdick, DJCote, ADuplessis, MNasveschuk, CGTaylor, AM Therapeutic compounds and uses thereof US Patent  US10239861 Publication Date 3/26/2019 
Target
Name:
Histone acetyltransferase KAT2B
Synonyms:
Histone acetyltransferase KAT2A/KAT2B KAT2B PCAF
Type:
PROTEIN
Mol. Mass.:
93045.76
Organism:
Homo sapiens (Human)
Description:
ChEMBL_1502838
Residue:
832
  
Inhibitor
Name:
BDBM50234944
Synonyms:
CHEMBL4072538 | US10239861, Example 60
Type:
Small organic molecule
Emp. Form.:
C11H17ClN4O
Mol. Mass.:
256.732
SMILES:
CN1CCC[C@H](C1)Nc1cnn(C)c(=O)c1Cl
: