Target
Indoleamine 2,3-dioxygenase 1
Ligand
BDBM21984
Substrate
BDBM21974
Meas. Tech.
Enzyme Inhibition Assay
pH
6.5±n/a
Temperature
310.15±n/a K
Ki
260±10 nM
Citation
 Carr, GChung, MKMauk, AGAndersen, RJ Synthesis of indoleamine 2,3-dioxygenase inhibitory analogues of the sponge alkaloid exiguamine a. J Med Chem 51:2634-7 (2008)  
Target
Name:
Indoleamine 2,3-dioxygenase 1
Synonyms:
I23O1_HUMAN IDO-1 INDO Indoleamine 2,3-dioxygenase | Indoleamine-pyrrole 2,3-dioxygenase
Type:
Enzyme
Mol. Mass.:
45330.80
Organism:
Homo sapiens (Human)
Description:
P14902
Residue:
403
  
Inhibitor
Name:
BDBM21984
Synonyms:
Tryptamine quinone, 25 | methyl 4-{4,7-dioxo-3-[2-(3-phenylpropanamido)ethyl]-4,7-dihydro-1H-indol-5-yl}-3-methyl-2,5-dioxo-1-propylimidazolidine-4-carboxylate
Type:
Small organic molecule
Emp. Form.:
C28H30N4O7
Mol. Mass.:
534.5604
SMILES:
CCCN1C(=O)N(C)C(C(=O)OC)(C1=O)C1=CC(=O)c2[nH]cc(CCNC(=O)CCc3ccccc3)c2C1=O
:
Substrate
Name:
BDBM21974
Synonyms:
(2S)-2-amino-3-(1H-indol-3-yl)propanoic acid L-tryptophan US9138393, L-Tryptophan | US9144538, L-Tryptophan
Type:
Amino Acid
Emp. Form.:
C11H12N2O2
Mol. Mass.:
204.2252
SMILES:
N[C@@H](Cc1c[nH]c2ccccc12)C(O)=O
: