Target
D(3) dopamine receptor
Ligand
BDBM371876
Substrate
Meas. Tech.
[125I]-7OH-PIPAT Binding Assay
Ki
0.186±n/a nM
Citation
 Cremonesi, SMicheli, FSemerano, TTarsi, L Dopamine D3 receptor antagonists US Patent  US10239870 Publication Date 3/26/2019 
Target
Name:
D(3) dopamine receptor
Synonyms:
DOPAMINE D3 Dopamine D3 receptor | Drd3
Type:
Protein
Mol. Mass.:
49540.58
Organism:
Rattus norvegicus (Rat)
Description:
P19020
Residue:
446
  
Inhibitor
Name:
BDBM371876
Synonyms:
US10239870, Example 89 | US10239870, Example 94
Type:
Small organic molecule
Emp. Form.:
C25H33F3N4S
Mol. Mass.:
478.617
SMILES:
Cn1c(SCCCN2CC[C@]3(CC3c3ccc(cc3)C(F)(F)F)C2)nnc1C1CCCCC1
: