Target
Sodium-dependent dopamine transporter
Ligand
BDBM22169
Substrate
BDBM22166
Meas. Tech.
Radioligand Binding Assay
pH
7.4±n/a
Temperature
277.15±n/a K
Ki
3.0±0.3 nM
Citation
 Hsin, LWChang, LTRothman, RBDersch, CMJacobson, AERice, KC Design and Synthesis of 2- and 3-Substituted-3-phenylpropyl Analogs of 1-[2-[Bis(4-fluorophenyl)methoxy]ethyl]-4-(3-phenylpropyl)piperazine and 1-[2-(Diphenylmethoxy)ethyl]-4-(3-phenylpropyl)piperazine: Role of Amino, Fluoro, Hydroxyl, Methoxyl, Methyl, Methylene, and Oxo Substituents on Affinity f J Med Chem 51:2795-806 (2008)  
Target
Name:
Sodium-dependent dopamine transporter
Synonyms:
DA transporter SC6A3_RAT Sodium-dependent dopamine transporter | Sodium-dependent dopamine transporter (DAT)
Type:
Multi-pass membrane protein
Mol. Mass.:
68749.45
Organism:
Rattus norvegicus (rat)
Description:
P23977
Residue:
619
  
Inhibitor
Name:
BDBM22169
Synonyms:
(1R)-3-(4-{2-[bis(4-fluorophenyl)methoxy]ethyl}piperazin-1-yl)-1-phenylpropan-1-ol GBR 12935 Analogue, (R)-3
Type:
Small organic molecule
Emp. Form.:
C28H32F2N2O2
Mol. Mass.:
466.5627
SMILES:
O[C@H](CCN1CCN(CCOC(c2ccc(F)cc2)c2ccc(F)cc2)CC1)c1ccccc1
:
Substrate
Name:
BDBM22166
Synonyms:
3-(4-iodophenyl)tropane-2-carboxylic acid methyl ester CHEMBL215376 RTI-258 [125I]RTI-55 | methyl (1R,2S,3S,5S)-3-(4-iodophenyl)-8-methyl-8-azabicyclo[3.2.1]octane-2-carboxylate
Type:
radiolabeled ligand
Emp. Form.:
C16H20INO2
Mol. Mass.:
385.24
SMILES:
[H][C@]12CC[C@]([H])([C@H]([C@H](C1)c1ccc(I)cc1)C(=O)OC)N2C
: