Target
RAF proto-oncogene serine/threonine-protein kinase
Ligand
BDBM202656
Substrate
Meas. Tech.
In Vitro Raf Activity
IC50
0.145±n/a nM
Citation
 Aversa, RJBarsanti, PABurger, MTDillon, MPDipesa, AHu, CLou, YNishiguchi, GAPan, YPolyakov, VRRamurthy, SRico, ACSetti, LQSmith, ASubramanian, STaft, BRTanner, HRWan, LYusuff, N Biaryl amide compounds as kinase inhibitors US Patent  US10245267 Publication Date 4/2/2019 
Target
Name:
RAF proto-oncogene serine/threonine-protein kinase
Synonyms:
C-Raf Protein Kinase RAF RAF1 Raf-1 Serine/threonine-protein kinase C-Raf | cRaf
Type:
Serine/threonine-protein kinase
Mol. Mass.:
73082.52
Organism:
Homo sapiens (Human)
Description:
P04049
Residue:
648
  
Inhibitor
Name:
BDBM202656
Synonyms:
US10245267, Example 1 US9242969, 1 | US9694016, 1
Type:
Small organic molecule
Emp. Form.:
C23H21F3N4O2
Mol. Mass.:
442.4336
SMILES:
Cc1ccc(NC(=O)c2cccc(c2)C(F)(F)F)cc1-c1cc(ncn1)N1CCOCC1
: