Target
RAF proto-oncogene serine/threonine-protein kinase [1-324]
Ligand
BDBM202717
Substrate
Meas. Tech.
In Vitro Raf Activity
IC50
0.508±n/a nM
Citation
 Aversa, RJBarsanti, PABurger, MTDillon, MPDipesa, AHu, CLou, YNishiguchi, GAPan, YPolyakov, VRRamurthy, SRico, ACSetti, LQSmith, ASubramanian, STaft, BRTanner, HRWan, LYusuff, N Biaryl amide compounds as kinase inhibitors US Patent  US10245267 Publication Date 4/2/2019 
Target
Name:
RAF proto-oncogene serine/threonine-protein kinase [1-324]
Synonyms:
C-Raf TR RAF RAF1 | RAF1_HUMAN
Type:
Enzyme Catalytic Domain
Mol. Mass.:
42815.85
Organism:
Homo sapiens (Human)
Description:
P04049 (aa 1-324)
Residue:
384
  
Inhibitor
Name:
BDBM202717
Synonyms:
US10245267, Example 63 US9242969, 63 | US9694016, 63
Type:
Small organic molecule
Emp. Form.:
C24H22F3N3O2
Mol. Mass.:
441.4456
SMILES:
Cc1ccc(cc1-c1ccnc(c1)N1CCOCC1)C(=O)Nc1cccc(c1)C(F)(F)F
: