Target
Tyrosine-protein kinase ABL1 [64-515]
Ligand
BDBM230775
Substrate
Meas. Tech.
Caliper Assay
IC50
0.500±n/a nM
Citation
 Furet, PGrotzfeld, RMJahnke, WJones, DManley, PWMarzinzik, APelle, XFSalem, BSchoepfer, J Benzamide derivatives for inhibiting the activity of ABL1, ABL2 and BCR-ABL1 US Patent  US9896444 Publication Date 2/20/2018 
Target
Name:
Tyrosine-protein kinase ABL1 [64-515]
Synonyms:
ABL ABL1_HUMAN Tyrosine-protein kinase ABL1 Tyrosine-protein kinase ABL1 (ABL) | Tyrosine-protein kinase ABL1 (ABL1)
Type:
Enzyme Catalytic Domain
Mol. Mass.:
51539.77
Organism:
Homo sapiens (Human)
Description:
aa 64-515
Residue:
452
  
Inhibitor
Name:
BDBM230775
Synonyms:
US9340537, 29 | US9896444, Example 29
Type:
Small organic molecule
Emp. Form.:
C23H19F3N4O4
Mol. Mass.:
472.4166
SMILES:
O[C@H]1CN(C[C@@H]1O)c1ccc(cc1-c1ccc([nH]1)C#N)C(=O)Nc1ccc(OC(F)(F)F)cc1
: