Target
Tyrosine-protein kinase ABL1 [64-515]
Ligand
BDBM230813
Substrate
Meas. Tech.
Radiometric Filter-Binding Assay
IC50
0.500±n/a nM
Citation
 Furet, PGrotzfeld, RMJahnke, WJones, DManley, PWMarzinzik, APelle, XFSalem, BSchoepfer, J Benzamide derivatives for inhibiting the activity of ABL1, ABL2 and BCR-ABL1 US Patent  US9896444 Publication Date 2/20/2018 
Target
Name:
Tyrosine-protein kinase ABL1 [64-515]
Synonyms:
ABL ABL1_HUMAN Tyrosine-protein kinase ABL1 Tyrosine-protein kinase ABL1 (ABL) | Tyrosine-protein kinase ABL1 (ABL1)
Type:
Enzyme Catalytic Domain
Mol. Mass.:
51539.77
Organism:
Homo sapiens (Human)
Description:
aa 64-515
Residue:
452
  
Inhibitor
Name:
BDBM230813
Synonyms:
US9340537, 67 | US9896444, Example 67
Type:
Small organic molecule
Emp. Form.:
C20H18ClF2N5O3
Mol. Mass.:
449.838
SMILES:
OCC1CN(C1)c1ncc(cc1-c1ccn[nH]1)C(=O)Nc1ccc(OC(F)(F)Cl)cc1
: