Target
Epidermal growth factor receptor [1-746,748-748,750-1210,A750P]
Ligand
BDBM373711
Substrate
Meas. Tech.
Kinase assay
Kd
50±n/a nM
Citation
 Mansour, TS 1,2-dithiolane and dithiol compounds useful in treating mutant EGFR-mediated diseases and conditions US Patent  US10246444 Publication Date 4/2/2019 
Target
Name:
Epidermal growth factor receptor [1-746,748-748,750-1210,A750P]
Synonyms:
EGFR EGFR_HUMAN ERBB1 | HER1
Type:
Enzyme Catalytic Domain
Mol. Mass.:
134064.36
Organism:
Homo sapiens (Human)
Description:
P00533[1-746,748-748,750-1210,A750P]
Residue:
1208
  
Inhibitor
Name:
BDBM373711
Synonyms:
US10246444, Example 40
Type:
Small organic molecule
Emp. Form.:
C30H26ClFN4O3S2
Mol. Mass.:
609.134
SMILES:
CCOc1cc2ncc(C#N)c(Nc3ccc(OCc4cccc(F)c4)c(Cl)c3)c2cc1NC(=O)CC1CCSS1
: