Target
Interleukin-1 receptor-associated kinase 4
Ligand
BDBM374320
Substrate
Meas. Tech.
Biochemical Assay
IC50
<100.0±n/a nM
Citation
 Chan, TGuckian, KJenkins, TThomas, JVessels, JKumaravel, GMeissner, RLyssikatos, JLucas, BLeaf, IDuffield, J IRAK4 inhibiting agents US Patent  US10246456 Publication Date 4/2/2019 
Target
Name:
Interleukin-1 receptor-associated kinase 4
Synonyms:
IRAK-4 IRAK4_HUMAN Interleukin-1 receptor-associated kinase 4 (IRAK4) | Renal carcinoma antigen NY-REN-64
Type:
Protein
Mol. Mass.:
51519.08
Organism:
Homo sapiens (Human)
Description:
Q9NWZ3
Residue:
460
  
Inhibitor
Name:
BDBM374320
Synonyms:
(S)-1-((6-(6-(1-aminobutyl)pyridin-2-yl)-1-(6-(hydroxymethyl)pyridin-2-yl)-1H-indazol-4-yl)oxy)-2-methylpropan-2-ol US10577367, Example 471
Type:
Small organic molecule
Emp. Form.:
C26H31N5O3
Mol. Mass.:
461.556
SMILES:
CCC[C@H](N)c1cccc(n1)-c1cc(OCC(C)(C)O)c2cnn(-c3cccc(CO)n3)c2c1
: