Target
Interleukin-1 receptor-associated kinase 4
Ligand
BDBM374321
Substrate
Meas. Tech.
Biochemical Assay
IC50
<100.0±n/a nM
Citation
 Chan, TGuckian, KJenkins, TThomas, JVessels, JKumaravel, GMeissner, RLyssikatos, JLucas, BLeaf, IDuffield, J IRAK4 inhibiting agents US Patent  US10246456 Publication Date 4/2/2019 
Target
Name:
Interleukin-1 receptor-associated kinase 4
Synonyms:
IRAK-4 IRAK4_HUMAN Interleukin-1 receptor-associated kinase 4 (IRAK4) | Renal carcinoma antigen NY-REN-64
Type:
Protein
Mol. Mass.:
51519.08
Organism:
Homo sapiens (Human)
Description:
Q9NWZ3
Residue:
460
  
Inhibitor
Name:
BDBM374321
Synonyms:
(6-{6-[6-((S)-1-Amino-butyl)-pyridin-2-yl]-4-fluoro-indazol-1-yl}-pyridin-2-yl)-methanol | US10246456, Example 473
Type:
Small organic molecule
Emp. Form.:
C13H9BrFN3O
Mol. Mass.:
322.132
SMILES:
OCc1cccc(n1)-n1ncc2c(F)cc(Br)cc12
: