Target
Interleukin-1 receptor-associated kinase 4
Ligand
BDBM374324
Substrate
Meas. Tech.
Biochemical Assay
IC50
<100.0±n/a nM
Citation
 Chan, TGuckian, KJenkins, TThomas, JVessels, JKumaravel, GMeissner, RLyssikatos, JLucas, BLeaf, IDuffield, J IRAK4 inhibiting agents US Patent  US10246456 Publication Date 4/2/2019 
Target
Name:
Interleukin-1 receptor-associated kinase 4
Synonyms:
IRAK-4 IRAK4_HUMAN Interleukin-1 receptor-associated kinase 4 (IRAK4) | Renal carcinoma antigen NY-REN-64
Type:
Protein
Mol. Mass.:
51519.08
Organism:
Homo sapiens (Human)
Description:
Q9NWZ3
Residue:
460
  
Inhibitor
Name:
BDBM374324
Synonyms:
(S)-(6-(6-(6-(1-aminobutyl)pyridin-2-yl)-4-(2-methoxyethoxy)-1H-indazol-1-yl)pyridin-2-yl)methanol | US10246456, Example 476
Type:
Small organic molecule
Emp. Form.:
C35H51N5O4SSi
Mol. Mass.:
665.961
SMILES:
CCC[C@H](N[S@](=O)C(C)(C)C)c1cccc(n1)-c1cc(OCCOC)c2cnn(-c3cccc(CO[Si](C)(C)C(C)(C)C)n3)c2c1
: