Target
Interleukin-1 receptor-associated kinase 4
Ligand
BDBM374327
Substrate
Meas. Tech.
Biochemical Assay
IC50
<100.0±n/a nM
Citation
 Chan, TGuckian, KJenkins, TThomas, JVessels, JKumaravel, GMeissner, RLyssikatos, JLucas, BLeaf, IDuffield, J IRAK4 inhibiting agents US Patent  US10246456 Publication Date 4/2/2019 
Target
Name:
Interleukin-1 receptor-associated kinase 4
Synonyms:
IRAK-4 IRAK4_HUMAN Interleukin-1 receptor-associated kinase 4 (IRAK4) | Renal carcinoma antigen NY-REN-64
Type:
Protein
Mol. Mass.:
51519.08
Organism:
Homo sapiens (Human)
Description:
Q9NWZ3
Residue:
460
  
Inhibitor
Name:
BDBM374327
Synonyms:
(6-(6-(6-((S)-1-aminobutyl)pyridin-2-yl)-4-((2S,5R)-5-methyltetrahydrofuran-2-yl)-1H-indazol-1-yl)pyridin-2-yl)methanol US10577367, Example 479
Type:
Small organic molecule
Emp. Form.:
C27H31N5O2
Mol. Mass.:
457.5673
SMILES:
CCC[C@H](N)c1cccc(n1)-c1cc([C@@H]2CC[C@@H](C)O2)c2cnn(-c3cccc(CO)n3)c2c1
: