Target
Interleukin-1 receptor-associated kinase 4
Ligand
BDBM374329
Substrate
Meas. Tech.
Biochemical Assay
IC50
<100.0±n/a nM
Citation
 Chan, TGuckian, KJenkins, TThomas, JVessels, JKumaravel, GMeissner, RLyssikatos, JLucas, BLeaf, IDuffield, J IRAK4 inhibiting agents US Patent  US10246456 Publication Date 4/2/2019 
Target
Name:
Interleukin-1 receptor-associated kinase 4
Synonyms:
IRAK-4 IRAK4_HUMAN Interleukin-1 receptor-associated kinase 4 (IRAK4) | Renal carcinoma antigen NY-REN-64
Type:
Protein
Mol. Mass.:
51519.08
Organism:
Homo sapiens (Human)
Description:
Q9NWZ3
Residue:
460
  
Inhibitor
Name:
BDBM374329
Synonyms:
(S)-(6-(6-(6-(1-aminoethyl)pyridin-2-yl)-4-(2-methoxyethoxy)-1H-indazol-1-yl)pyrazin-2-yl)methanol US10577367, Example 481
Type:
Small organic molecule
Emp. Form.:
C22H24N6O3
Mol. Mass.:
420.4644
SMILES:
COCCOc1cc(cc2n(ncc12)-c1cncc(CO)n1)-c1cccc(n1)[C@H](C)N
: