Target
Interleukin-1 receptor-associated kinase 4
Ligand
BDBM374384
Substrate
Meas. Tech.
Biochemical Assay
IC50
<100.0±n/a nM
Citation
 Chan, TGuckian, KJenkins, TThomas, JVessels, JKumaravel, GMeissner, RLyssikatos, JLucas, BLeaf, IDuffield, J IRAK4 inhibiting agents US Patent  US10246456 Publication Date 4/2/2019 
Target
Name:
Interleukin-1 receptor-associated kinase 4
Synonyms:
IRAK-4 IRAK4_HUMAN Interleukin-1 receptor-associated kinase 4 (IRAK4) | Renal carcinoma antigen NY-REN-64
Type:
Protein
Mol. Mass.:
51519.08
Organism:
Homo sapiens (Human)
Description:
Q9NWZ3
Residue:
460
  
Inhibitor
Name:
BDBM374384
Synonyms:
US10246456, Example 539 | US10577367, Example 539
Type:
Small organic molecule
Emp. Form.:
C21H19F2N5
Mol. Mass.:
379.4059
SMILES:
CC[C@H](N)c1cccc(n1)-c1ccc2cnn(-c3cccc(n3)C(F)F)c2c1
: