Target
Interleukin-1 receptor-associated kinase 4
Ligand
BDBM374392
Substrate
Meas. Tech.
Biochemical Assay
IC50
<100.0±n/a nM
Citation
 Chan, TGuckian, KJenkins, TThomas, JVessels, JKumaravel, GMeissner, RLyssikatos, JLucas, BLeaf, IDuffield, J IRAK4 inhibiting agents US Patent  US10246456 Publication Date 4/2/2019 
Target
Name:
Interleukin-1 receptor-associated kinase 4
Synonyms:
IRAK-4 IRAK4_HUMAN Interleukin-1 receptor-associated kinase 4 (IRAK4) | Renal carcinoma antigen NY-REN-64
Type:
Protein
Mol. Mass.:
51519.08
Organism:
Homo sapiens (Human)
Description:
Q9NWZ3
Residue:
460
  
Inhibitor
Name:
BDBM374392
Synonyms:
US10246456, Example 572 | US10577367, Example 572
Type:
Small organic molecule
Emp. Form.:
C22H22F2N6O
Mol. Mass.:
424.4465
SMILES:
CCC[C@H](N)c1cccc(n1)-c1cc(OC)c2cnn(-c3nccc(n3)C(F)F)c2c1
: