Target
Interleukin-1 receptor-associated kinase 4
Ligand
BDBM374399
Substrate
Meas. Tech.
Biochemical Assay
IC50
<100.0±n/a nM
Citation
 Chan, TGuckian, KJenkins, TThomas, JVessels, JKumaravel, GMeissner, RLyssikatos, JLucas, BLeaf, IDuffield, J IRAK4 inhibiting agents US Patent  US10246456 Publication Date 4/2/2019 
Target
Name:
Interleukin-1 receptor-associated kinase 4
Synonyms:
IRAK-4 IRAK4_HUMAN Interleukin-1 receptor-associated kinase 4 (IRAK4) | Renal carcinoma antigen NY-REN-64
Type:
Protein
Mol. Mass.:
51519.08
Organism:
Homo sapiens (Human)
Description:
Q9NWZ3
Residue:
460
  
Inhibitor
Name:
BDBM374399
Synonyms:
US10246456, Example 579 | US10577367, Example 579
Type:
Small organic molecule
Emp. Form.:
C24H24F3N5O2
Mol. Mass.:
471.4749
SMILES:
CCC[C@H](N)c1cccc(n1)-c1cc(COC(F)(F)F)c2cnn(-c3cccc(CO)n3)c2c1
: