Target
Fibroblast growth factor receptor 1
Ligand
BDBM261949
Substrate
Meas. Tech.
FGFR Enzymatic Assay (pre-incubated for 4 hours)
IC50
115±n/a nM
Citation
 Sokolsky, AWu, LYao, W Bicyclic heterocycles as FGFR4 inhibitors US Patent  US10251892 Publication Date 4/9/2019 
Target
Name:
Fibroblast growth factor receptor 1
Synonyms:
BFGFR Basic fibroblast growth factor receptor 1 (FGFR1) CEK FGFR-1 FGFR-1, (FL) FGFR1_HUMAN FLT2 Fibroblast growth factor receptor 1 (FGFR-1) Fms-like tyrosine kinase 2 N-sam bFGF-R | c-fgr
Type:
Receptor
Mol. Mass.:
91861.70
Organism:
Homo sapiens (Human)
Description:
P11362
Residue:
822
  
Inhibitor
Name:
BDBM261949
Synonyms:
3-(2,6-difluoro-3,5-dimethoxyphenyl)-1-ethyl-7-(3-methyl-1-(pyridin-3-ylmethyl)-1H-pyrazol-4-yl)-3,4-dihydropyrido[4,3-d]pyrimidin-2(1H)-one US10632126, Example 50 US9708318, 50
Type:
Small organic molecule
Emp. Form.:
C27H26F2N6O3
Mol. Mass.:
520.5305
SMILES:
CCN1C(=O)N(Cc2cnc(cc12)-c1cn(Cc2cccnc2)nc1C)c1c(F)c(OC)cc(OC)c1F
: