Target
Free fatty acid receptor 1
Ligand
BDBM374855
Substrate
Meas. Tech.
IPOne assay
EC50
7.00±n/a nM
Citation
 Eckhardt, MWagner, HPeters, S Indanylaminopyrazinylcyclopropanecarboxylic acids, pharmaceutical compositions and uses thereof US Patent  US10253004 Publication Date 4/9/2019 
Target
Name:
Free fatty acid receptor 1
Synonyms:
FFAR1 G-protein Coupled Receptor 40 | GPR40
Type:
G Protein-Coupled Receptor (GPCR)
Mol. Mass.:
31473.32
Organism:
Homo sapiens (Human)
Description:
O14842
Residue:
300
  
Inhibitor
Name:
BDBM374855
Synonyms:
US10253004, Example 1 | trans-2-(5-{(R)-7-Fluoro-4-[4-(3-hydroxy-3-methyl-butoxy)-2,6-dimethyl-phenyl]-indan-1-ylamino}-pyrazin-2-yl)-cyclopropanecarboxylic acid (ca. 1:1 mixture of trans-diastereomers with respect to cyclopropane)
Type:
Small organic molecule
Emp. Form.:
C30H34FN3O4
Mol. Mass.:
519.6071
SMILES:
Cc1cc(OCCC(C)(C)O)cc(C)c1-c1ccc(F)c2[C@@H](CCc12)Nc1cnc(cn1)C1C[C@@H]1C(O)=O
: