Target
Free fatty acid receptor 1
Ligand
BDBM375095
Substrate
Meas. Tech.
IPOne assay
EC50
35.0±n/a nM
Citation
 Eckhardt, MWagner, HPeters, S Indanylaminopyrazinylcyclopropanecarboxylic acids, pharmaceutical compositions and uses thereof US Patent  US10253004 Publication Date 4/9/2019 
Target
Name:
Free fatty acid receptor 1
Synonyms:
FFAR1 G-protein Coupled Receptor 40 | GPR40
Type:
G Protein-Coupled Receptor (GPCR)
Mol. Mass.:
31473.32
Organism:
Homo sapiens (Human)
Description:
O14842
Residue:
300
  
Inhibitor
Name:
BDBM375095
Synonyms:
(1S,2S)-2-(5-{(R)-4-[4-(5-Methoxy-pyrazin-2-yl)-phenyl]-indan-1-ylamino}-pyrazin-2-yl)-cyclopropanecarboxylic acid | US10253004, Example 9
Type:
Small organic molecule
Emp. Form.:
C28H25N5O3
Mol. Mass.:
479.5298
SMILES:
COc1cnc(cn1)-c1ccc(cc1)-c1cccc2[C@@H](CCc12)Nc1cnc(cn1)[C@H]1C[C@@H]1C(O)=O
: