Target
Free fatty acid receptor 1
Ligand
BDBM375101
Substrate
Meas. Tech.
IPOne assay
EC50
7.00±n/a nM
Citation
 Eckhardt, MWagner, HPeters, S Indanylaminopyrazinylcyclopropanecarboxylic acids, pharmaceutical compositions and uses thereof US Patent  US10253004 Publication Date 4/9/2019 
Target
Name:
Free fatty acid receptor 1
Synonyms:
FFAR1 G-protein Coupled Receptor 40 | GPR40
Type:
G Protein-Coupled Receptor (GPCR)
Mol. Mass.:
31473.32
Organism:
Homo sapiens (Human)
Description:
O14842
Residue:
300
  
Inhibitor
Name:
BDBM375101
Synonyms:
US10253004, Example 15
Type:
Small organic molecule
Emp. Form.:
C25H24FN3O2
Mol. Mass.:
417.4754
SMILES:
Cc1cccc(C)c1-c1ccc(F)c2[C@@H](CCc12)Nc1cnc(cn1)[C@H]1C[C@@H]1C(O)=O
: