Target
Free fatty acid receptor 1
Ligand
BDBM375104
Substrate
Meas. Tech.
IPOne assay
EC50
150±n/a nM
Citation
 Eckhardt, MWagner, HPeters, S Indanylaminopyrazinylcyclopropanecarboxylic acids, pharmaceutical compositions and uses thereof US Patent  US10253004 Publication Date 4/9/2019 
Target
Name:
Free fatty acid receptor 1
Synonyms:
FFAR1 G-protein Coupled Receptor 40 | GPR40
Type:
G Protein-Coupled Receptor (GPCR)
Mol. Mass.:
31473.32
Organism:
Homo sapiens (Human)
Description:
O14842
Residue:
300
  
Inhibitor
Name:
BDBM375104
Synonyms:
US10253004, Example 18
Type:
Small organic molecule
Emp. Form.:
C23H19F3N4O2
Mol. Mass.:
440.4178
SMILES:
Nc1cc(F)c(c(F)c1)-c1ccc(F)c2[C@@H](CCc12)Nc1cnc(cn1)[C@H]1C[C@@H]1C(O)=O
: