Target
Free fatty acid receptor 1
Ligand
BDBM375136
Substrate
Meas. Tech.
IPOne assay
EC50
74.0±n/a nM
Citation
 Eckhardt, MWagner, HPeters, S Indanylaminopyrazinylcyclopropanecarboxylic acids, pharmaceutical compositions and uses thereof US Patent  US10253004 Publication Date 4/9/2019 
Target
Name:
Free fatty acid receptor 1
Synonyms:
FFAR1 G-protein Coupled Receptor 40 | GPR40
Type:
G Protein-Coupled Receptor (GPCR)
Mol. Mass.:
31473.32
Organism:
Homo sapiens (Human)
Description:
O14842
Residue:
300
  
Inhibitor
Name:
BDBM375136
Synonyms:
US10253004, Example 50
Type:
Small organic molecule
Emp. Form.:
C23H17F4N3O2
Mol. Mass.:
443.3936
SMILES:
OC(=O)[C@H]1C[C@@H]1c1cnc(N[C@@H]2CCc3c2c(F)ccc3-c2c(F)cc(F)cc2F)cn1
: