Target
Ubiquitin carboxyl-terminal hydrolase isozyme L3
Ligand
BDBM23424
Substrate
BDBM23422
Meas. Tech.
Enzyme Inhibition Assay
pH
7.8±n/a
Temperature
295.15±n/a K
IC50
>334000±n/a nM
Km
83.3±1.5 nM
Citation
 Hirayama, KAoki, SNishikawa, KMatsumoto, TWada, K Identification of novel chemical inhibitors for ubiquitin C-terminal hydrolase-L3 by virtual screening. Bioorg Med Chem 15:6810-8 (2007)  
Target
Name:
Ubiquitin carboxyl-terminal hydrolase isozyme L3
Synonyms:
UCHL3 Ubiquitin C-terminal Hydrolase L3 (UCH-L3) | Ubiquitin thioesterase L3
Type:
Hydrolase; protease
Mol. Mass.:
26168.69
Organism:
Homo sapiens (Human)
Description:
Human recombinant UCH-L3 was purchased from Boston Biochem, Inc.(Cambridge, MA).
Residue:
230
  
Inhibitor
Name:
BDBM23424
Synonyms:
ChemBridge CNS-Set 6382507, 4 | N-cyclopropyl-2-[(4-methoxyphenyl)(4-methylbenzene)sulfonamido]acetamide
Type:
Small organic molecule
Emp. Form.:
C19H22N2O4S
Mol. Mass.:
374.454
SMILES:
COc1ccc(cc1)N(CC(=O)NC1CC1)S(=O)(=O)c1ccc(C)cc1
:
Substrate
Name:
BDBM23422
Synonyms:
Ub-AMC | ubiquitin-7-amido-4-methylcoumarin
Type:
Fluorogenic substrate
Emp. Form.:
Mol. Mass.:
SMILES:
: