Target
Oxysterols receptor LXR-beta
Ligand
BDBM23846
Substrate
BDBM10852
Meas. Tech.
alpha-Glucosidase Inhibition Assay
IC50
46000±n/a nM
Citation
 Dodo, KAoyama, ANoguchi-Yachide, TMakishima, MMiyachi, HHashimoto, Y Co-existence of alpha-glucosidase-inhibitory and liver X receptor-regulatory activities and their separation by structural development. Bioorg Med Chem 16:4272-85 (2008)  
Target
Name:
Oxysterols receptor LXR-beta
Synonyms:
LXRB Liver X, LXR beta NR1H2 Nuclear receptor NER Ubiquitously-expressed nuclear receptor
Type:
Enzyme Catalytic Domain
Mol. Mass.:
50978.79
Organism:
Homo sapiens (Human)
Description:
P55055
Residue:
460
  
Inhibitor
Name:
BDBM23846
Synonyms:
5,25-dimethoxy-14-oxapentacyclo[20.2.2.2^{10,13}.1^{15,19}.0^{2,7}]nonacosa-1(24),2(7),3,5,10,12,15,17,19(27),22,25,28-dodecaene | Riccardin C derivative, 19d
Type:
Small organic molecule
Emp. Form.:
C30H28O3
Mol. Mass.:
436.5415
SMILES:
COc1ccc-2c(CCc3ccc(Oc4cccc(CCc5ccc-2c(OC)c5)c4)cc3)c1
:
Substrate