Target
Serine/threonine-protein kinase pim-1
Ligand
BDBM377153
Substrate
Meas. Tech.
Pim Enzyme Assays
IC50
<100±n/a nM
Citation
 Xue, CFeng, HLi, YZhang, K Thiazolecarboxamides and pyridinecarboxamide compounds useful as Pim kinase inhibitors US Patent  US10265307 Publication Date 4/23/2019 
Target
Name:
Serine/threonine-protein kinase pim-1
Synonyms:
PIM-1 Kinase PIM1_HUMAN Serine/threonine-protein kinase (PIM1) Serine/threonine-protein kinase PIM1 | Serine/threonine-protein kinase pim-1 (PIM1)
Type:
Protein
Mol. Mass.:
35681.82
Organism:
Homo sapiens (Human)
Description:
P11309
Residue:
313
  
Inhibitor
Name:
BDBM377153
Synonyms:
N-{4-[(3S)-3-Aminopiperidin-1-yl]-2,3-dihydrofuro[2,3-b]pyridin-5-yl}-2-(2,6-difluorophenyl)-1,3-thiazole-4-carboxamide US10517858, Example 10 US11229631, Example 10
Type:
Small organic molecule
Emp. Form.:
C22H21F2N5O2S
Mol. Mass.:
457.496
SMILES:
N[C@H]1CCCN(C1)c1c2CCOc2ncc1NC(=O)c1csc(n1)-c1c(F)cccc1F
: