Target
Serine/threonine-protein kinase pim-2
Ligand
BDBM377159
Substrate
Meas. Tech.
Pim Enzyme Assays
IC50
<100±n/a nM
Citation
 Xue, CFeng, HLi, YZhang, K Thiazolecarboxamides and pyridinecarboxamide compounds useful as Pim kinase inhibitors US Patent  US10265307 Publication Date 4/23/2019 
Target
Name:
Serine/threonine-protein kinase pim-2
Synonyms:
PIM2 Pim-2h Serine/threonine-protein kinase PIM | Serine/threonine-protein kinase pim-2 (PIM2)
Type:
Serine/threonine-protein kinase
Mol. Mass.:
34185.93
Organism:
Homo sapiens (Human)
Description:
Q9P1W9
Residue:
311
  
Inhibitor
Name:
BDBM377159
Synonyms:
US10265307, Example 15-2 US10828290, Example 15 (Diastereoisomer 2) | US11229631, Example 15 Diastereoisomer 2
Type:
Small organic molecule
Emp. Form.:
C23H24F2N6O2S
Mol. Mass.:
486.537
SMILES:
N[C@H]1CCCN(C1)c1c2CC[C@@H](O)c2ncc1NC(=O)c1nc(sc1N)-c1c(F)cccc1F
: