Target
Serine/threonine-protein kinase pim-1
Ligand
BDBM377170
Substrate
Meas. Tech.
Pim Enzyme Assays
IC50
<100±n/a nM
Citation
 Xue, CFeng, HLi, YZhang, K Thiazolecarboxamides and pyridinecarboxamide compounds useful as Pim kinase inhibitors US Patent  US10265307 Publication Date 4/23/2019 
Target
Name:
Serine/threonine-protein kinase pim-1
Synonyms:
PIM-1 Kinase PIM1_HUMAN Serine/threonine-protein kinase (PIM1) Serine/threonine-protein kinase PIM1 | Serine/threonine-protein kinase pim-1 (PIM1)
Type:
Protein
Mol. Mass.:
35681.82
Organism:
Homo sapiens (Human)
Description:
P11309
Residue:
313
  
Inhibitor
Name:
BDBM377170
Synonyms:
US10265307, Example 22-2 | US11229631, Example 22 Diastereoisomer 2
Type:
Small organic molecule
Emp. Form.:
C25H24F3N5O2
Mol. Mass.:
483.4856
SMILES:
N[C@H]1CCCN(C1)c1c2CC[C@@H](O)c2ncc1NC(=O)c1ccc(F)c(n1)-c1c(F)cccc1F
: