Target
Xanthine dehydrogenase/oxidase
Ligand
BDBM377696
Substrate
Meas. Tech.
XO (Xanthine Oxidase) Inhibition Activity Assay
IC50
90.2±n/a nM
Citation
 Yang, XHuang, CMa, FZhang, JWang, XZhang, Y Carboxy substituted (hetero) aromatic ring derivatives and preparation method and uses thereof US Patent  US10266496 Publication Date 4/23/2019 
Target
Name:
Xanthine dehydrogenase/oxidase
Synonyms:
XD XDHA XO Xanthine dehydrogenase/oxidase | Xanthine oxidase
Type:
Enzyme
Mol. Mass.:
146441.21
Organism:
Homo sapiens (Human)
Description:
P47989
Residue:
1333
  
Inhibitor
Name:
BDBM377696
Synonyms:
US10266496, Example 17
Type:
Small organic molecule
Emp. Form.:
C15H8N2O4
Mol. Mass.:
280.235
SMILES:
OC(=O)c1ccc(cc1O)-c1cc(cc2ocnc12)C#N
: