Target
Xanthine dehydrogenase/oxidase
Ligand
BDBM377697
Substrate
Meas. Tech.
XO (Xanthine Oxidase) Inhibition Activity Assay
IC50
63.3±n/a nM
Citation
 Yang, XHuang, CMa, FZhang, JWang, XZhang, Y Carboxy substituted (hetero) aromatic ring derivatives and preparation method and uses thereof US Patent  US10266496 Publication Date 4/23/2019 
Target
Name:
Xanthine dehydrogenase/oxidase
Synonyms:
XD XDHA XO Xanthine dehydrogenase/oxidase | Xanthine oxidase
Type:
Enzyme
Mol. Mass.:
146441.21
Organism:
Homo sapiens (Human)
Description:
P47989
Residue:
1333
  
Inhibitor
Name:
BDBM377697
Synonyms:
US10266496, Example 18
Type:
Small organic molecule
Emp. Form.:
C17H11NO4
Mol. Mass.:
293.2735
SMILES:
Cc1cc2c(cc(cc2o1)C#N)-c1ccc(C(O)=O)c(O)c1
: