Target
Xanthine dehydrogenase/oxidase
Ligand
BDBM377702
Substrate
Meas. Tech.
XO (Xanthine Oxidase) Inhibition Activity Assay
IC50
34.6±n/a nM
Citation
 Yang, XHuang, CMa, FZhang, JWang, XZhang, Y Carboxy substituted (hetero) aromatic ring derivatives and preparation method and uses thereof US Patent  US10266496 Publication Date 4/23/2019 
Target
Name:
Xanthine dehydrogenase/oxidase
Synonyms:
XD XDHA XO Xanthine dehydrogenase/oxidase | Xanthine oxidase
Type:
Enzyme
Mol. Mass.:
146441.21
Organism:
Homo sapiens (Human)
Description:
P47989
Residue:
1333
  
Inhibitor
Name:
BDBM377702
Synonyms:
US10266496, Example 29
Type:
Small organic molecule
Emp. Form.:
C16H8FNO4
Mol. Mass.:
297.2374
SMILES:
OC(=O)c1ccc(cc1O)-c1cc(cc2cc(F)oc12)C#N
: