Target
Solute carrier family 22 member 12
Ligand
BDBM377694
Substrate
Meas. Tech.
URAT1 (Urate Anion Transporter) Inhibition Activity Assay
IC50
234±n/a nM
Citation
 Yang, XHuang, CMa, FZhang, JWang, XZhang, Y Carboxy substituted (hetero) aromatic ring derivatives and preparation method and uses thereof US Patent  US10266496 Publication Date 4/23/2019 
Target
Name:
Solute carrier family 22 member 12
Synonyms:
OATL4 RST S22AC_HUMAN Solute carrier family 22 member 12 URAT1 Urate anion exchanger 1 (URAT1) | Uric Acid Transporter 1 (URAT1)
Type:
Enzyme
Mol. Mass.:
59638.65
Organism:
Homo sapiens (Human)
Description:
Q96S37
Residue:
553
  
Inhibitor
Name:
BDBM377694
Synonyms:
US10266496, Example 6
Type:
Small organic molecule
Emp. Form.:
C18H11F3N2O3
Mol. Mass.:
360.2867
SMILES:
Cn1c(cc2c(cc(cc12)C#N)-c1ccc(C(O)=O)c(O)c1)C(F)(F)F
: