Target
Solute carrier family 22 member 12
Ligand
BDBM377700
Substrate
Meas. Tech.
URAT1 (Urate Anion Transporter) Inhibition Activity Assay
IC50
14.0±n/a nM
Citation
 Yang, XHuang, CMa, FZhang, JWang, XZhang, Y Carboxy substituted (hetero) aromatic ring derivatives and preparation method and uses thereof US Patent  US10266496 Publication Date 4/23/2019 
Target
Name:
Solute carrier family 22 member 12
Synonyms:
OATL4 RST S22AC_HUMAN Solute carrier family 22 member 12 URAT1 Urate anion exchanger 1 (URAT1) | Uric Acid Transporter 1 (URAT1)
Type:
Enzyme
Mol. Mass.:
59638.65
Organism:
Homo sapiens (Human)
Description:
Q96S37
Residue:
553
  
Inhibitor
Name:
BDBM377700
Synonyms:
US10266496, Example 27
Type:
Small organic molecule
Emp. Form.:
C16H8ClNO4
Mol. Mass.:
313.692
SMILES:
OC(=O)c1ccc(cc1O)-c1cc(cc2oc(Cl)cc12)C#N
: