Target
Tyrosine-protein kinase BTK
Ligand
BDBM378853
Substrate
Meas. Tech.
Microfluidic Off-Chip Mobility Shift Assay Protocol for Potency Assessment Against BTK Enzyme
IC50
550±n/a nM
Citation
 Caldwell, RD 2-oxo-imidazopyridines as reversible BTK inhibitors and uses thereof US Patent  US10266528 Publication Date 4/23/2019 
Target
Name:
Tyrosine-protein kinase BTK
Synonyms:
AGMX1 Agammaglobulinaemia tyrosine kinase B cell progenitor kinase BPK BTK_HUMAN Tyrosine Kinase BTK Tyrosine-protein kinase BTK (BTK)
Type:
Enzyme
Mol. Mass.:
76289.95
Organism:
Homo sapiens (Human)
Description:
Q06187
Residue:
659
  
Inhibitor
Name:
BDBM378853
Synonyms:
US10266528, Compound 7
Type:
Small organic molecule
Emp. Form.:
C20H19FN6O3
Mol. Mass.:
410.4017
SMILES:
CC(C)(C)c1nnc(o1)C(=O)NCc1ccc(cc1F)-c1ccnc2[nH]c(=O)[nH]c12
: