Target
Lysine-specific histone demethylase 1A
Ligand
BDBM261742
Substrate
Meas. Tech.
Monoamine Oxidase Assays
Ki
50±n/a nM
Citation
 Ortega Muñoz, AFyfe, MCMartinell Pedemonte, MTirapu Fernandez De La Cuesta, IEstiarte-Martinez, M Arylcyclopropylamine based demethylase inhibitors of LSD1 and their medical use US Patent  US9708309 Publication Date 7/18/2017 
Target
Name:
Lysine-specific histone demethylase 1A
Synonyms:
AOF2 Flavin-containing amine oxidase domain-containing protein 2 KDM1A KIAA0601 Lysine-specific demethylase 1 (LSD1) Lysine-specific histone demethylase 1 (LSD1)
Type:
Enzyme
Mol. Mass.:
92901.01
Organism:
Homo sapiens (Human)
Description:
O60341
Residue:
852
  
Inhibitor
Name:
BDBM261742
Synonyms:
US9708309, 2
Type:
Small organic molecule
Emp. Form.:
C20H21N3OS
Mol. Mass.:
351.465
SMILES:
Nc1ncc(CN[C@H]2C[C@@H]2c2ccc(OCc3ccccc3)cc2)s1
: