Target
Amine oxidase [flavin-containing] B
Ligand
BDBM261745
Substrate
Meas. Tech.
Monoamine Oxidase Assays
Ki
500±n/a nM
Citation
 Ortega Muñoz, AFyfe, MCMartinell Pedemonte, MTirapu Fernandez De La Cuesta, IEstiarte-Martinez, M Arylcyclopropylamine based demethylase inhibitors of LSD1 and their medical use US Patent  US9708309 Publication Date 7/18/2017 
Target
Name:
Amine oxidase [flavin-containing] B
Synonyms:
AOFB_HUMAN MAOB Monoamine oxidase type B (MAO B) Monoamine oxidase type B (MAOB)
Type:
Protein
Mol. Mass.:
58768.76
Organism:
Homo sapiens (Human)
Description:
P27338
Residue:
520
  
Inhibitor
Name:
BDBM261745
Synonyms:
US10233178, Example 12 | US9708309, 12
Type:
Small organic molecule
Emp. Form.:
C19H19FN4O2
Mol. Mass.:
354.3782
SMILES:
Nc1nnc(CN[C@H]2C[C@@H]2c2ccc(OCc3cccc(F)c3)cc2)o1
: