Target
Histone deacetylase 1
Ligand
BDBM19130
Substrate
Carboxyfluorescein (FAM)-labeled acetylated peptide
Meas. Tech.
HDAC Inhibition Assay
pH
7.5±n/a
Temperature
298.15±n/a K
IC50
4±n/a nM
Citation
 Chen, YLopez-Sanchez, MSavoy, DNBilladeau, DDDow, GSKozikowski, AP A series of potent and selective, triazolylphenyl-based histone deacetylases inhibitors with activity against pancreatic cancer cells and Plasmodium falciparum. J Med Chem 51:3437-48 (2008)  
Target
Name:
Histone deacetylase 1
Synonyms:
Cereblon/Histone deacetylase 1 HDAC1 Histone deacetylase 1 (HDAC1) RPD3L1
Type:
Enzyme
Mol. Mass.:
55090.27
Organism:
Homo sapiens (Human)
Description:
Q13547
Residue:
482
  
Inhibitor
Name:
BDBM19130
Synonyms:
(2E,4E,6R)-7-[4-(dimethylamino)phenyl]-N-hydroxy-4,6-dimethyl-7-oxohepta-2,4-dienamide TSA | Trichostatin A (TSA)
Type:
Small organic molecule
Emp. Form.:
C17H22N2O3
Mol. Mass.:
302.3682
SMILES:
CC(C=CC(=O)NO)C=C(C)C(=O)c1ccc(cc1)N(C)C
:
Substrate
Name:
Carboxyfluorescein (FAM)-labeled acetylated peptide
Synonyms:
Type:
Peptide
Mol. Mass.:
358.43
Organism:
Description:
Residue:
3
NA