Target
Induced myeloid leukemia cell differentiation protein Mcl-1 homolog
Ligand
BDBM380466
Substrate
Meas. Tech.
High-Throughput Competitive Fluorescence Polarization (FP) Screening Assay
IC50
2.90±n/a nM
Citation
 Walensky, LD Inhibition of MCL-1 and/or BFL-1/A1 US Patent  US9926306 Publication Date 3/27/2018 
Target
Name:
Induced myeloid leukemia cell differentiation protein Mcl-1 homolog
Synonyms:
Bcl-2-related protein EAT/mcl1 Mcl-1 | Mcl1
Type:
Developmental protein
Mol. Mass.:
35215.08
Organism:
Mus musculus (Mouse)
Description:
Residue:
331
  
Inhibitor
Name:
BDBM380466
Synonyms:
US9926306, ID 183-51
Type:
Small organic molecule
Emp. Form.:
C17H20F3N3O4S
Mol. Mass.:
419.419
SMILES:
Oc1ccc(\C=N\N2\C(SCC2(O)C(F)(F)F)=N\C2CCCCC2)c(O)c1O
: